2-[Isopentylthio]ethanal

Normal alkane RI, polar column, temperature ramp

View large format table.

Column type Active phase I Reference Comment
CapillaryHP-Innowax1609.Rossner, Kubec, et al., 200230. m/0.25 mm/0.25 μm, N2, 5. K/min; Tstart: 60. C; Tend: 220. C

References

Rossner, Kubec, et al., 2002
Rossner, J.; Kubec, R.; Velisek, J.; Davidek, J., Formation of aldehydes from S-alk(en)ylcysteines and their sulfoxides, Eur. Food Res. Technol., 2002, 215, 2, 124-130, https://doi.org/10.1007/s00217-002-0524-z . [all data]