1,4-Heptadien-3-ol, 3-methyl-6-(4-methylphenyl)

Kovats' RI, non-polar column, temperature ramp

Data compiled by: NIST Mass Spectrometry Data Center, William E. Wallace, director

Column type Capillary
Active phase SPB-1
Column length (m) 30.
Carrier gas He
Substrate
Column diameter (mm) 0.32
Phase thickness (μm) 0.25
Tstart (C) 60.
Tend (C) 225.
Heat rate (K/min) 2.
Initial hold (min) 3.
Final hold (min) 5.
I 1510.
ReferenceJayaprakasha, Jena, et al., 2002
Comment MSDC-RI

References

Jayaprakasha, Jena, et al., 2002
Jayaprakasha, G.K.; Jena, B.S.; Negi, P.S.; Sakariah, K.K., Evaluation of antioxidant activities and antimutagenicity of turmeric oil: a byproduct from curcumin production, Z. Naturforsch. C:, 2002, 57c, 828-835, retrieved from http://www.znaturforsch.com/57c/s57c0828.pdf. [all data]