1-hydroxy-tacrine

Normal alkane RI, non-polar column, custom temperature program

View large format table.

Column type Active phase I Reference Comment
CapillaryHP-12134.Schütz, Ahrens, et al., 200112. m/0.20 mm/0.33 μm; Program: 100 0C (12 min) 10 K/min -> 280 0C (5 min) 30 K/min -> 300 0C (10 min)

References

Schütz, Ahrens, et al., 2001
Schütz, H.; Ahrens, B.; Erdmann, F.; Weiler, G., Detection of the cholinesterase inhibitor tacrine and its main metabolites, Arch. Kriminol., 2001, 207, 5/6, 154-161. [all data]