dehydro-oxosparteine

Normal alkane RI, non-polar column, temperature ramp

View large format table.

Column type Active phase I Reference Comment
CapillaryDB-12120.Martínez-Herrera, Robledo-Quintos, et al., 200130. m/0.25 mm/0.25 μm, He, 2. K/min, 280. C @ 15. min; Tstart: 150. C

References

Martínez-Herrera, Robledo-Quintos, et al., 2001
Martínez-Herrera, J.; Robledo-Quintos, N.; Mora-Escobedo, R.; Dávila-Ortiz, G., Alkaloid composition of Lupinus campestris from Mexico, J. Food Biochem., 2001, 25, 2, 117-125, https://doi.org/10.1111/j.1745-4514.2001.tb00728.x . [all data]