2,3-diphenylbut-2-enal

Normal alkane RI, non-polar column, temperature ramp

Data compiled by: NIST Mass Spectrometry Data Center, William E. Wallace, director

Column type Capillary
Active phase DB-1
Column length (m) 25.
Carrier gas He
Substrate
Column diameter (mm) 0.25
Phase thickness (μm) 0.13
Tstart (C) 60.
Tend (C) 200.
Heat rate (K/min) 4.
Initial hold (min) 2.
Final hold (min)
I 1930.
ReferenceRapior, Konska, et al., 2000
Comment MSDC-RI

References

Rapior, Konska, et al., 2000
Rapior, S.; Konska, G.; Guillot, J.; Andary, C.; Bessiere, J.-M., Volatile composition of Laetiporus sulphureus, Cryptogamie, Mycol., 2000, 21, 1, 67-72, https://doi.org/10.1016/S0181-1584(00)00109-3 . [all data]