Dauca-8(14),11-dien-9-ol

Normal alkane RI, non-polar column, custom temperature program

Data compiled by: NIST Mass Spectrometry Data Center, William E. Wallace, director

Column type Capillary
Active phase CP Sil 5 CB
Column length (m) 25.
Carrier gas He
Substrate
Column diameter (mm)
Phase thickness (μm) 0.39
Program not specified
I 1703.
ReferenceWeyerstahl, Marschall, et al., 1999
Comment MSDC-RI

Normal alkane RI, polar column, custom temperature program

View large format table.

Column type Active phase I Reference Comment
CapillaryDB-Wax2487.Weyerstahl, Marschall, et al., 1999He; Column length: 60. m; Phase thickness: 0.25 μm; Program: not specified

References

Weyerstahl, Marschall, et al., 1999
Weyerstahl, P.; Marschall, H.; Son, P.T.; Giang, P.M., Constituents of Vietnamese pemou oil - a reinvestigation, Flavour Fragr. J., 1999, 14, 6, 409-410, https://doi.org/10.1002/(SICI)1099-1026(199911/12)14:6<409::AID-FFJ843>3.0.CO;2-B . [all data]