Triphenylmethane, 2-chloro

Lee's RI, non-polar column, temperature ramp

View large format table.

Column type Active phase I Reference Comment
CapillaryBPX-5351.7Schwarzbauer, Franke, et al., 199950. m/0.25 mm/0.25 μm, He, 50. C @ 3. min, 3. K/min; Tend: 300. C

References

Schwarzbauer, Franke, et al., 1999
Schwarzbauer, J.; Franke, S.; Francke, W., Chlorinated di- and triphenylmethanes in sediments of the Mulde and Elbe rivers. Part IV of organic compounds as contaminants of the Elbe river and its tributaries, Fresenius J. Anal. Chem., 1999, 365, 6, 529-536, https://doi.org/10.1007/s002160051517 . [all data]