3β,5α,6β-trihydroxystigmastanol, TMS

Van Den Dool and Kratz RI, non-polar column, temperature ramp

Data compiled by: NIST Mass Spectrometry Data Center, William E. Wallace, director

Column type Capillary
Active phase DB-1
Column length (m) 30.
Carrier gas H2
Substrate
Column diameter (mm) 0.32
Phase thickness (μm) 0.1
Tstart (C) 80.
Tend (C) 280.
Heat rate (K/min) 3.
Initial hold (min) 3.
Final hold (min) 15.
I 3446.
ReferenceMeyer, Jungnickel, et al., 1998
Comment MSDC-RI

References

Meyer, Jungnickel, et al., 1998
Meyer, W.; Jungnickel, H.; Jandke, M.; Dettner, K.; Spiteller, G., On the cytotoxity of oxidized phytosterols isolated from photoautotrophic cell cultures of Chenopodium rubrum tested on meal-worms Tenebrio molitor, Phytochemistry, 1998, 47, 5, 789-797, https://doi.org/10.1016/S0031-9422(97)00622-5 . [all data]