Ipanguline A4

Kovats' RI, non-polar column, temperature ramp

View large format table.

Column type Active phase I Reference Comment
CapillaryDB-12985.Jenett-Siems, Ott, et al., 2005He, 6. K/min; Column length: 30. m; Column diameter: 0.32 mm; Tstart: 70. C; Tend: 300. C

Kovats' RI, non-polar column, custom temperature program

View large format table.

Column type Active phase I Reference Comment
CapillaryDB-12985.Jenett-Siems, Schimming, et al., 1998Program: not specified

References

Jenett-Siems, Ott, et al., 2005
Jenett-Siems, K.; Ott, S.C.; Schimming, T.; Siems, K.; Müller, F.; Hilker, M.; Witte, L.; Hartmann, T.; Austin, D.F.; Eich, E., Ipangulines and minalobines, chemotaxonomic markers of the infrageneric Ipomoea taxon subgenus Quamoclit, section Mina, Phytochemistry, 2005, 66, 2, 223-231, https://doi.org/10.1016/j.phytochem.2004.11.019 . [all data]

Jenett-Siems, Schimming, et al., 1998
Jenett-Siems, K.; Schimming, T.; Kaloga, M.; Eich, E.; Siems, K.; Gupta, M.P.; Witte, L.; Hartmann, T., Pyrrolizidine alkaloids of Ipomoea hederifolia and related species, Phytochemistry, 1998, 47, 8, 1551-1560, https://doi.org/10.1016/S0031-9422(97)01082-0 . [all data]