geranyl 6- O-(α-L-rhamonopyranosyl)-β-D-glucopyranoside, TFA

Van Den Dool and Kratz RI, non-polar column, custom temperature program

Data compiled by: NIST Mass Spectrometry Data Center, William E. Wallace, director

Column type CapillaryCapillary
Active phase DB-5MSDB-5MS
Column length (m) 30.30.
Carrier gas HeHe
Substrate
Column diameter (mm) 0.250.25
Phase thickness (μm) 0.250.25
Program 125C => 3C/min => 220C => 2C/min => 280C125C => 3C/min => 220C => 2C/min => 280C
I 2205.2219.
ReferenceChassagne, Crouzet, et al., 1998Chassagne, Crouzet, et al., 1998
Comment MSDC-RI MSDC-RI

References

Chassagne, Crouzet, et al., 1998
Chassagne, D.; Crouzet, J.; Bayonove, C.L.; Baumes, R.L., Identification of passion fruit glycosides by gas chromatography/mass spectrometry, J. Agric. Food Chem., 1998, 46, 10, 4352-4357, https://doi.org/10.1021/jf980416k . [all data]