2,6,10,14-tetramethyl-7(3-methyl-pent-4-enyl)-pentadec-2,5,9,13-ene

Normal alkane RI, non-polar column, temperature ramp

View large format table.

Column type Active phase I Reference Comment
CapillaryHP-12201.Wraige, Belt, et al., 1997He, 300. C @ 10. min; Column length: 12. m; Column diameter: 0.2 mm; Tstart: 40. C

References

Wraige, Belt, et al., 1997
Wraige, E.J.; Belt, S.T.; Lewis, C.A.; Cooke, D.A.; Robert, J.-M.; Massé, G.; Rowland, S.J., Variations in structures and distributions of C25 highly branched isoprenoid (HBI) alkenes in cultures of the diatom, Haslea ostrearia (Simonsen), Org. Geochem., 1997, 27, 7/8, 497-505, https://doi.org/10.1016/S0146-6380(97)00086-7 . [all data]