5-β-Cholestan-3-α,7-α,12-α,25,26-pentol, TMS

Normal alkane RI, non-polar column, custom temperature program

View large format table.

Column type Active phase I Reference Comment
CapillaryMethyl Silicone3547.Meng and Sjövall, 199725. m/0.32 mm/0.25 μm; Program: 60 0C 30 K/min -> 210 0C (1.5 min) 2.5 K/min -> 320 0C (20 min)

References

Meng and Sjövall, 1997
Meng, L.-J.; Sjövall, J., Method for combined analysis of profiles of conjugated progesterone metabolites and bile acids in serum and urine of pregnant women, J. Chromatogr. B, 1997, 688, 1, 11-26, https://doi.org/10.1016/S0378-4347(97)88051-6 . [all data]