5-Pregnen-3-β-ol, 20-α-GlcNAc, MeTMS

Normal alkane RI, non-polar column, custom temperature program

Data compiled by: NIST Mass Spectrometry Data Center, William E. Wallace, director

Column type Capillary
Active phase Methyl Silicone
Column length (m)
Carrier gas
Substrate
Column diameter (mm)
Phase thickness (μm)
Program not specified
I 4308.
ReferenceMeng, Reyes, et al., 1997
Comment MSDC-RI

References

Meng, Reyes, et al., 1997
Meng, L.-J.; Reyes, H.; Palma, J.; Hernandez, I.; Ribalta, J.; Sjövall, J., Profiles of bile acids and progesterone metabolites in the urine and serum of women with intrahepatic cholestasis of pregnancy, J. Hepatol., 1997, 27, 2, 346-357, https://doi.org/10.1016/S0168-8278(97)80181-X . [all data]