3-α,4-ξ,7-β-Trihydroxy-5-β-cholic acid, methyl ester, TMS

Normal alkane RI, non-polar column, custom temperature program

View large format table.

Column type Active phase I Reference Comment
CapillaryMethyl Silicone3464.Meng, Reyes, et al., 1997Program: not specified

References

Meng, Reyes, et al., 1997
Meng, L.-J.; Reyes, H.; Palma, J.; Hernandez, I.; Ribalta, J.; Sjövall, J., Effects of ursodeoxycholic acid on conjugated bile acids and progesterone metabolites in serum and urine of patients with intrahepatic cholestasis of pregnancy, J. Hepatol., 1997, 27, 6, 1029-1040, https://doi.org/10.1016/S0168-8278(97)80147-X . [all data]