Putrescine, bis-isoBOC

Van Den Dool and Kratz RI, non-polar column, temperature ramp

View large format table.

Column type Active phase I Reference Comment
CapillaryDB-52154.Kim, Paik, et al., 199730. m/0.25 mm/0.11 μm, He, 60. C @ 2. min, 4. K/min; Tend: 280. C

References

Kim, Paik, et al., 1997
Kim, K.R.; Paik, M.J.; Kim, J.H.; Dong, S.W.; Jeong, D.H., Rapid gas chromatographic profiling and screening of biologically active amines, J. Pharm. Biomed. Anal., 1997, 15, 9-10, 1309-1318, https://doi.org/10.1016/S0731-7085(96)02048-1 . [all data]