Isobutylcarbamate, N-tert.-butyl

Van Den Dool and Kratz RI, non-polar column, temperature ramp

Data compiled by: NIST Mass Spectrometry Data Center, William E. Wallace, director

Column type Capillary
Active phase DB-5
Column length (m) 30.
Carrier gas He
Substrate
Column diameter (mm) 0.25
Phase thickness (μm) 0.11
Tstart (C) 60.
Tend (C) 280.
Heat rate (K/min) 4.
Initial hold (min) 2.
Final hold (min)
I 1121.
ReferenceKim, Paik, et al., 1997
Comment MSDC-RI

References

Kim, Paik, et al., 1997
Kim, K.R.; Paik, M.J.; Kim, J.H.; Dong, S.W.; Jeong, D.H., Rapid gas chromatographic profiling and screening of biologically active amines, J. Pharm. Biomed. Anal., 1997, 15, 9-10, 1309-1318, https://doi.org/10.1016/S0731-7085(96)02048-1 . [all data]