8-αH,11-Hexahydrofarnesyldrimane

Normal alkane RI, non-polar column, custom temperature program

View large format table.

Column type Active phase I Reference Comment
CapillaryOV-1012836.Robson and Rowland, 1994Program: not specified

References

Robson and Rowland, 1994
Robson, J.N.; Rowland, S.J., Synthesis of polypodane (C30) and structurally related C25 bicyclic hydrocarbons, Org. Geochem., 1994, 21, 8/9, 937-942, https://doi.org/10.1016/0146-6380(94)90052-3 . [all data]