1-Amino-6-nitropyrene

Van Den Dool and Kratz RI, non-polar column, temperature ramp

View large format table.

Column type Active phase I Reference Comment
CapillaryDB-53229.Korfmacher, Rushing, et al., 198730. m/0.25 mm/0.25 μm, He, 100. C @ 1. min, 20. K/min; Tend: 280. C

References

Korfmacher, Rushing, et al., 1987
Korfmacher, W.A.; Rushing, L.G.; Engelbach, R.J.; Freeman, J.P.; Djuric, A.; Fifer, E.K.; Beland, F.A., Analysis of three aminonitropyrene isomers via fused silica gas chromatography combined with negative ion atmospheric pressure ionization mass spectrometry, J. Hi. Res. Chromatogr. Chromatogr. Comm., 1987, 10, 1, 43-45, https://doi.org/10.1002/jhrc.1240100110 . [all data]