12-β-Hydroxy-GA36, methyl ester, TMS

Van Den Dool and Kratz RI, non-polar column, custom temperature program

Data compiled by: NIST Mass Spectrometry Data Center, William E. Wallace, director

Column type Capillary
Active phase OV-1
Column length (m)
Carrier gas
Substrate
Column diameter (mm)
Phase thickness (μm)
Program not specified
I 2786.
ReferenceGaskin, Hutchison, et al., 1984
Comment MSDC-RI

References

Gaskin, Hutchison, et al., 1984
Gaskin, P.; Hutchison, M.; Lewis, N.; MacMillan, J.; Phinney, B.O., Microbiological conversion of 12-oxygenated and other derivatives of ent-kaur-16-en-19-oic acid by Gibberella Fujikuroi, mutant B1-41a, Phytochemistry, 1984, 23, 3, 559-564, https://doi.org/10.1016/S0031-9422(00)80380-5 . [all data]