Aluminium-1,3,5,7-tetramethyl-2,4,6,8-tetraethylporphyrine complex, OTMS

Normal alkane RI, non-polar column, temperature ramp

View large format table.

Column type Active phase I Reference Comment
CapillaryOV-14190.Marriott, Gill, et al., 1982H2, 10. K/min; Column length: 3.5 m; Column diameter: 0.30 mm; Tstart: 50. C; Tend: 300. C

References

Marriott, Gill, et al., 1982
Marriott, P.J.; Gill, J.P.; Eglinton, G., Capillary gas chromatography and gas chromatography-mass spectrometry of metal(III) and metal(IV) porphyrin complexes, J. Chromatogr., 1982, 249, 2, 291-310, https://doi.org/10.1016/S0021-9673(00)86340-2 . [all data]