Homovanillic acid, TFA-ME

Kovats' RI, non-polar column, isothermal

Data compiled by: NIST Mass Spectrometry Data Center, William E. Wallace, director

Column type Packed
Active phase OV-101
Column length (m) 1.8
Carrier gas
Substrate Chromosorb GHP
Column diameter (mm)
Phase thickness (μm)
Temperature (C) 170.
I 1485.
ReferenceMidgley, Couch, et al., 1979
Comment MSDC-RI

References

Midgley, Couch, et al., 1979
Midgley, J.M.; Couch, M.W.; Crowley, J.R.; Williams, C.M., Identification and Quantitative Determination of o- and m-Hydroxymandelic Acid in Human Urine, Biomed. Mass Spectrom., 1979, 6, 11, 485-490, https://doi.org/10.1002/bms.1200061106 . [all data]