Pyrimidine, 4,6-dihydroxy-5-nitro, TMS

Kovats' RI, non-polar column, custom temperature program

Data compiled by: NIST Mass Spectrometry Data Center, William E. Wallace, director

Column type Packed
Active phase OV-1
Column length (m) 1.
Carrier gas
Substrate Gas Chrom Q
Column diameter (mm)
Phase thickness (μm)
Program not specified
I 1565.
ReferenceYamaji, Kimura, et al., 1978
Comment MSDC-RI

References

Yamaji, Kimura, et al., 1978
Yamaji, A.; Kimura, S.; Kawasaki, H.; Yuki, H., Gas chromatographic analysis of pyrimidine and purine bases by retention indices, Yakugaku Zasshi, 1978, 98, 1, 1536-1541. [all data]