2α,3α-cyclopropane-5α-androstan-6.α,17β-diol, bisTMIPS

Kovats' RI, non-polar column, isothermal

View large format table.

Column type Active phase Temperature (C) I Reference Comment
PackedOV-1280.3761.Quilliam and Temleton, 1977N2

References

Quilliam and Temleton, 1977
Quilliam, M.A.; Temleton, J.F., Sterically crowded trialkylsilyl ether derivatives for the analysis of steroid matobolites, Steroids, 1977, 29, 5, 613-626, https://doi.org/10.1016/0039-128X(77)90013-7 . [all data]