2α,3α-cyclopropane-5α-androstan-4.α,17α-diol, bisTBDMS

Kovats' RI, non-polar column, isothermal

Data compiled by: NIST Mass Spectrometry Data Center, William E. Wallace, director

Column type PackedPacked
Active phase OV-1OV-1
Column length (m)
Carrier gas N2N2
Substrate
Column diameter (mm)
Phase thickness (μm)
Temperature (C) 260.280.
I 3154.3176.
ReferenceQuilliam and Temleton, 1977Quilliam and Temleton, 1977
Comment MSDC-RI MSDC-RI

References

Quilliam and Temleton, 1977
Quilliam, M.A.; Temleton, J.F., Sterically crowded trialkylsilyl ether derivatives for the analysis of steroid matobolites, Steroids, 1977, 29, 5, 613-626, https://doi.org/10.1016/0039-128X(77)90013-7 . [all data]