Glycerol 1-heptadecanoate, methylboronate

Kovats' RI, non-polar column, isothermal

View large format table.

Column type Active phase Temperature (C) I Reference Comment
PackedOV-1230.2478.Gaskell and Brooks, 1977N2, Gas Chrom Q (100-120 mesh); Column length: 1. m

References

Gaskell and Brooks, 1977
Gaskell, S.J.; Brooks, C.J.W., Gas-liquid chromatography-mass spectrometry of phospholipid mixtures after enzymic hydrolysis, J. Chromatogr., 1977, 142, 469-480, https://doi.org/10.1016/S0021-9673(01)92060-6 . [all data]