5-α-Androstan-7-α,17-β-diol, TFA

Kovats' RI, non-polar column, isothermal

View large format table.

Column type Active phase Temperature (C) I Reference Comment
PackedOV-101207.2154.Berthou, Picart, et al., 1976Column length: 2.1 m
CapillaryOV-101236.2158.Berthou, Picart, et al., 1976Column length: 55. m; Column diameter: 0.37 mm

References

Berthou, Picart, et al., 1976
Berthou, F.; Picart, D.; Bardou, L.; Floch, H.H., Separation of C19 and C21 dihydroxysteroids by open-hole tubular glass columns and lipophilic gel chromatography, J. Chromatogr., 1976, 118, 2, 135-155, https://doi.org/10.1016/S0021-9673(00)81203-0 . [all data]