5-α-Androstan-3-β,17-α-diol, HFB

Kovats' RI, non-polar column, isothermal

Data compiled by: NIST Mass Spectrometry Data Center, William E. Wallace, director

Column type PackedCapillaryCapillary
Active phase OV-101OV-101OV-101
Column length (m) 2.155.55.
Carrier gas
Substrate
Column diameter (mm)  0.370.37
Phase thickness (μm)
Temperature (C) 214.236.236.
I 2389.2390.2394.
ReferenceBerthou, Picart, et al., 1976Berthou, Picart, et al., 1976Berthou, Picart, et al., 1976
Comment MSDC-RI MSDC-RI MSDC-RI

References

Berthou, Picart, et al., 1976
Berthou, F.; Picart, D.; Bardou, L.; Floch, H.H., Separation of C19 and C21 dihydroxysteroids by open-hole tubular glass columns and lipophilic gel chromatography, J. Chromatogr., 1976, 118, 2, 135-155, https://doi.org/10.1016/S0021-9673(00)81203-0 . [all data]