Thiocyclohexane, 4-isopropylidene

Kovats' RI, non-polar column, custom temperature program

View large format table.

Column type Active phase I Reference Comment
PackedSqualane1121.Stopp, Engewald, et al., 1975N2, Chromosorb W (60-80 mesh); Column length: 3. m; Program: not specified

Kovats' RI, polar column, custom temperature program

View large format table.

Column type Active phase I Reference Comment
PackedCarbowax 20M1384.Stopp, Engewald, et al., 1975N2, Chromosorn W (80-100 mesh); Column length: 3. m; Program: not specified

References

Stopp, Engewald, et al., 1975
Stopp, V.I.; Engewald, W.; Remane, H.; Borsdorf, R., Gas chromatographisches retentionsverhalten von exo/endo-doppelbindungsisomeren sechsringverbindungen, J. Prakt. Chem., 1975, 317, 3, 420-424, https://doi.org/10.1002/prac.19753170309 . [all data]