11-Deoxycortisol enol-TMS

Normal alkane RI, non-polar column, custom temperature program

Data compiled by: NIST Mass Spectrometry Data Center, William E. Wallace, director

Column type CapillaryPacked
Active phase HP-1OV-1
Column length (m) 17.2.
Carrier gas Helium
Substrate  Gas Chrom P
Column diameter (mm) 0.20
Phase thickness (μm) 0.11
Program 180 0C 3 0C/min -> 229 0C 40 0C/min -> 310 0C (5 min)not specified
I 3162.3178.
ReferencePereira, Marques, et al., 2001Chambaz, Defaye, et al., 1973
Comment MSDC-RI MSDC-RI

References

Pereira, Marques, et al., 2001
Pereira, H.M.G.; Marques, M.A.S.; Cardoso, J.N.; Neto, F.R.A., Derivatization study of endogenous and synthetic corticosteroids by gas chromatography mass spectrometry in Recent Advances in Doping Analysis, Schanzer, W.; Geyer, H.; Gotzmann, A.; Mareck-Engelke, U., ed(s)., Sport und Buch Strauss, Koln, 2001, 203-207. [all data]

Chambaz, Defaye, et al., 1973
Chambaz, E.M.; Defaye, G.; Madani, C., Trimethyl silyl ether-enol-trimethyl silyl ether - A new type derivative for the gas phase study of hormonal steroids, Anal. Chem., 1973, 45, 7, 1090-1098, https://doi.org/10.1021/ac60329a035 . [all data]