1,1'-Biphenyl-2-ol, 2',5,6-trichloro

Normal alkane RI, non-polar column, temperature ramp

Data compiled by: NIST Mass Spectrometry Data Center, William E. Wallace, director

Column type CapillaryCapillary
Active phase HP-5HP-5
Column length (m) 30.30.
Carrier gas HeliumHelium
Substrate
Column diameter (mm) 0.250.25
Phase thickness (μm) 0.250.25
Tstart (C) 50.50.
Tend (C) 280.280.
Heat rate (K/min) 3.3.
Initial hold (min) 3.3.
Final hold (min) 20.20.
I 1935.1952.
ReferenceZenkevich, Moeder, et al., 2004Zenkevich, Moeder, et al., 2004
Comment MSDC-RI MSDC-RI

References

Zenkevich, Moeder, et al., 2004
Zenkevich, I.G.; Moeder, M.; Koeller, G.; Schrader, S., Using new structurally related additive schemes in the precalculation of gas chromatographic retention indices of polychlorinated hydroxybiphenyls on HP-5 stationary phase, J. Chromatogr. A, 2004, 1025, 2, 227-236, https://doi.org/10.1016/j.chroma.2003.10.106 . [all data]