13,25-dimethylhenpentacontane

Normal alkane RI, non-polar column, temperature ramp

Data compiled by: NIST Mass Spectrometry Data Center, William E. Wallace, director

Column type Capillary
Active phase Ultra-1
Column length (m) 12.5
Carrier gas He
Substrate
Column diameter (mm) 0.2
Phase thickness (μm)
Tstart (C) 150.
Tend (C) 320.
Heat rate (K/min) 4.
Initial hold (min)
Final hold (min)
I 5144.
ReferenceNelson and Charlet, 2003
Comment MSDC-RI

References

Nelson and Charlet, 2003
Nelson, D.R.; Charlet, L.D., Cuticular hydrocarbons of the sunflower beetle,Zygogramma exclamationis, Comp. Biochem. Physiol. B: Comp. Biochem., 2003, 135, 2, 273-284, https://doi.org/10.1016/S1096-4959(03)00080-0 . [all data]