2-hydroxyfuranodiene

Normal alkane RI, non-polar column, temperature ramp

View large format table.

Column type Active phase I Reference Comment
CapillaryDB-51725.Morteza-Semnani and Saeedi, 200330. m/0.25 mm/0.25 μm, He, 60. C @ 5. min, 4. K/min; Tend: 275. C

References

Morteza-Semnani and Saeedi, 2003
Morteza-Semnani, K.; Saeedi, M., Constituents of the essential oil of Commiphora myrrha (Nees) Engl. var. molmol, J. Essent. Oil Res., 2003, 15, 1, 50-51, https://doi.org/10.1080/10412905.2003.9712264 . [all data]