γ-Ponalactone

Normal alkane RI, polar column, temperature ramp

View large format table.

Column type Active phase I Reference Comment
CapillaryTC-Wax2029.Miyazawa, Yamafuji, et al., 20033. K/min; Column length: 60. m; Column diameter: 0.25 mm; Tstart: 80. C; Tend: 240. C

References

Miyazawa, Yamafuji, et al., 2003
Miyazawa, M.; Yamafuji, C.; Kurose, K.; Ishikawa, Y., Volatile components of the rhizomes of Cirsium japonicum DC, Flavour Fragr. J., 2003, 18, 1, 15-17, https://doi.org/10.1002/ffj.1135 . [all data]