1-Tetradecanol, 3-chloro, acetate

Kovats' RI, non-polar column, isothermal

Data compiled by: NIST Mass Spectrometry Data Center, William E. Wallace, director

Column type CapillaryCapillaryCapillary
Active phase SE-30SE-30SE-30
Column length (m) 25.25.25.
Carrier gas N2N2N2
Substrate
Column diameter (mm) 0.330.330.33
Phase thickness (μm)
Temperature (C) 180.200.220.
I 1966.1966.1970.
ReferenceHaken and Korhonen, 1986Haken and Korhonen, 1986Haken and Korhonen, 1986
Comment MSDC-RI MSDC-RI MSDC-RI

References

Haken and Korhonen, 1986
Haken, J.K.; Korhonen, I.O.O., Gas chromatography of homologous esters. XXXII. Capillary chromatography of C1-C18 monochlorinated n-alkyl acetates, J. Chromatogr., 1986, 356, 79-94, https://doi.org/10.1016/S0021-9673(00)91468-7 . [all data]