Isobutyl 2-diethylaminoethyl sulfide

Normal alkane RI, non-polar column, temperature ramp

View large format table.

Column type Active phase I Reference Comment
CapillaryDB-51292.Savel'eva, Zenkevich, et al., 200325. m/0.20 mm/0.33 μm, Helium, 40. C @ 1. min, 5. K/min, 270. C @ 15. min
CapillaryDB-51292.Savel'eva, Zenkevich, et al., 200225. m/0.20 mm/0.33 μm, Helium, 40. C @ 1. min, 5. K/min, 270. C @ 15. min

Normal alkane RI, non-polar column, custom temperature program

View large format table.

Column type Active phase I Reference Comment
CapillaryMethyl Silicone1292.Savelieva and Zenkevich I., 2003Program: not specified
CapillaryMethyl Silicone1297.Savelieva and Zenkevich I., 2003Program: not specified

References

Savel'eva, Zenkevich, et al., 2003
Savel'eva, E.I.; Zenkevich, I.G.; Radilov, A.S., Identification the Products of Chemical Neutralization of O-Isobutyl-S-(2-diethylaminoethyl)methylthiophosphonate in the Composition of Bitumen-Salt Matrices, Zh. Anal. Khim. (Rus.), 2003, 58, 2, 135-145. [all data]

Savel'eva, Zenkevich, et al., 2002
Savel'eva, E.I.; Zenkevich, I.G.; Kuznetsova, T.A.; Radilov, A.S.; Pshenichnaya, G.V., Investigation of Products of Transformation of Phosphororganic Toxic Substances with Gas Chromatography - Mass Spectrometry, Rus. Khim. Zh. (Rus.), 2002, 56, 6, 82-91. [all data]

Savelieva and Zenkevich I., 2003
Savelieva, E.; Zenkevich I., Analisi GC/MS di agenti chimici nervini, Laboratorio 2000, 2003, 17, 6/7, 24-26. [all data]