isomustakone

Normal alkane RI, non-polar column, temperature ramp

Data compiled by: NIST Mass Spectrometry Data Center, William E. Wallace, director

Column type Capillary
Active phase DB-5
Column length (m) 25.
Carrier gas N2
Substrate
Column diameter (mm) 0.23
Phase thickness (μm) 0.15
Tstart (C) 50.
Tend (C) 250.
Heat rate (K/min) 3.
Initial hold (min)
Final hold (min)
I 1657.
ReferenceMahmout, Bessière, et al., 2002
Comment MSDC-RI

References

Mahmout, Bessière, et al., 2002
Mahmout, Y.; Bessière, J.-M.; Dolmazon, R., Constituents of the essential oil of Cyperus maculatus Boëck, J. Essent. Oil Res., 2002, 14, 4, 263-265, https://doi.org/10.1080/10412905.2002.9699848 . [all data]