Pacifigorgia-2(10),11-diene

Van Den Dool and Kratz RI, non-polar column, custom temperature program

View large format table.

Column type Active phase I Reference Comment
CapillaryCP Sil 5 CB1435.Paul, König, et al., 2001H2; Column length: 25. m; Program: not specified

References

Paul, König, et al., 2001
Paul, C.; König, W.A.; Muhle, H., Pacifigorgianes and tamariscene as constituents of Frullania tamarisci and Valeriana officinalis, Phytochemistry, 2001, 57, 2, 307-313, https://doi.org/10.1016/S0031-9422(01)00018-8 . [all data]