Venlafaxine-M (O-desmethyl-HO-) isomer-1 2AC

Kovats' RI, non-polar column, temperature ramp

Data compiled by: NIST Mass Spectrometry Data Center, William E. Wallace, director

Column type Capillary
Active phase HP-1
Column length (m) 12.
Carrier gas He
Substrate
Column diameter (mm) 0.2
Phase thickness (μm) 0.33
Tstart (C) 100.
Tend (C) 310.
Heat rate (K/min) 30.
Initial hold (min) 3.
Final hold (min) 8.
I 2430.
ReferenceBickeboeller-Friedrich and Maurer, 2001
Comment MSDC-RI

References

Bickeboeller-Friedrich and Maurer, 2001
Bickeboeller-Friedrich, J.; Maurer, H.H., Screening for detection of new antidepressants, neuroleptics, hypnotics, and their metabolites in urine by GC-MS developed using rat liver microsomes, Ther. Drug Monit., 2001, 23, 1, 61-70, https://doi.org/10.1097/00007691-200102000-00012 . [all data]