L-carvenyl acetate

Kovats' RI, polar column, temperature ramp

Data compiled by: NIST Mass Spectrometry Data Center, William E. Wallace, director

Column type Capillary
Active phase DB-Wax
Column length (m) 60.
Carrier gas He
Substrate
Column diameter (mm) 0.25
Phase thickness (μm)
Tstart (C) 40.
Tend (C) 200.
Heat rate (K/min) 2.
Initial hold (min) 2.
Final hold (min)
I 1734.
ReferenceUmano, Hagi, et al., 1994
Comment MSDC-RI

Normal alkane RI, polar column, temperature ramp

View large format table.

Column type Active phase I Reference Comment
CapillaryDB-Wax1731.Umano, Hagi, et al., 200060. m/0.25 mm/0.25 μm, He, 40. C @ 2. min, 2. K/min; Tend: 200. C

References

Umano, Hagi, et al., 1994
Umano, K.; Hagi, Y.; Tamura, T.; Shoji, A.; Shibamoto, T., Identification of volatile compounds isolated from round kumquat (Fortunella japonica Swingle), J. Agric. Food Chem., 1994, 42, 9, 1888-1890, https://doi.org/10.1021/jf00045a011 . [all data]