Benzyl β-D-glucopyranoside, TFA

Van Den Dool and Kratz RI, non-polar column, temperature ramp

View large format table.

Column type Active phase I Reference Comment
CapillaryDB-5MS1751.Ugliano, Bartowsky, et al., 200630. m/0.25 mm/0.25 μm, He, 125. C @ 2. min, 3. K/min, 290. C @ 30. min

Normal alkane RI, non-polar column, temperature ramp

View large format table.

Column type Active phase I Reference Comment
CapillaryDB-51746.Morales, Duque, et al., 200025. m/0.25 mm/1. μm, He, 3. K/min, 280. C @ 10. min; Tstart: 125. C

References

Ugliano, Bartowsky, et al., 2006
Ugliano, M.; Bartowsky, E.J.; McCarthy, J.; Moio, L.; Henschke, P.A., Hydrolysis and Transformation of Grape Glycosidically Bound Volatile Compounds during Fermentation with Three Saccharomyces Yeast Strains, J. Agric. Food Chem., 2006, 54, 17, 6322-6331, https://doi.org/10.1021/jf0607718 . [all data]

Morales, Duque, et al., 2000
Morales, A.L.; Duque, C.; Bautista, E., Identification of free and glycosidically bound volatiles and glycosides by capillary GC and capillary GC-MS in Lulo del Chocó (Solanum topiro), J. Hi. Res. Chromatogr., 2000, 23, 5, 379-385, https://doi.org/10.1002/(SICI)1521-4168(20000501)23:5<379::AID-JHRC379>3.0.CO;2-B . [all data]