1-Hexanol, 4-chloro, acetate

Kovats' RI, non-polar column, isothermal

Data compiled by: NIST Mass Spectrometry Data Center, William E. Wallace, director

Column type CapillaryCapillaryCapillaryCapillaryCapillary
Active phase SE-30SE-30SE-30SE-30SE-30
Column length (m)   25.25.25.
Carrier gas   N2N2N2
Substrate
Column diameter (mm)   0.330.330.33
Phase thickness (μm)
Temperature (C) 100.120.100.120.140.
I 1186.1163.1186.1163.1187.
ReferenceTarjan, Nyiredy, et al., 1989Tarjan, Nyiredy, et al., 1989Haken and Korhonen, 1986Haken and Korhonen, 1986Haken and Korhonen, 1986
Comment MSDC-RI MSDC-RI MSDC-RI MSDC-RI MSDC-RI
Column type Capillary
Active phase SE-30
Column length (m) 25.
Carrier gas N2
Substrate
Column diameter (mm) 0.33
Phase thickness (μm)
Temperature (C) 160.
I 1194.
ReferenceHaken and Korhonen, 1986
Comment MSDC-RI

References

Tarjan, Nyiredy, et al., 1989
Tarjan, G.; Nyiredy, Sz.; Gyor, M.; Lombosi, E.R.; Lombosi, T.S.; Budahegyi, M.V.; Meszaros, S.Y.; Takacs, J.M., Review. Thirtieth Anniversary of the Retention Index According to Kovats in Gas-Liquid Chromatography, J. Chromatogr., 1989, 472, 1-92, https://doi.org/10.1016/S0021-9673(00)94099-8 . [all data]

Haken and Korhonen, 1986
Haken, J.K.; Korhonen, I.O.O., Gas chromatography of homologous esters. XXXII. Capillary chromatography of C1-C18 monochlorinated n-alkyl acetates, J. Chromatogr., 1986, 356, 79-94, https://doi.org/10.1016/S0021-9673(00)91468-7 . [all data]