2-propyl hexanal

Normal alkane RI, polar column, temperature ramp

View large format table.

Column type Active phase I Reference Comment
CapillaryCP-Wax 52CB1279.Hwan and Chou, 199950. m/0.32 mm/0.22 μm, H2, 60. C @ 4. min, 2. K/min, 190. C @ 21. min

References

Hwan and Chou, 1999
Hwan, C.-H.; Chou, C.-C., Volatile components of the Chinese fermented soya bean curd as affected by the addition of ethanol in ageing solution, J. Sci. Food Agric., 1999, 79, 2, 243-248, https://doi.org/10.1002/(SICI)1097-0010(199902)79:2<243::AID-JSFA179>3.0.CO;2-I . [all data]