8,9,10-trinorborn-5-ene-2-spiro-1'-(2'-butyroxycyclohexane)

Kovats' RI, polar column, isothermal

Data compiled by: NIST Mass Spectrometry Data Center, William E. Wallace, director

Column type CapillaryCapillary
Active phase Carbowax 20MCarbowax 20M
Column length (m) 50.50.
Carrier gas
Substrate
Column diameter (mm) 0.320.32
Phase thickness (μm) 0.30.3
Temperature (C) 190.200.
I 2214.32223.1
ReferenceBoneva and Skumov, 1999Boneva and Skumov, 1999
Comment MSDC-RI MSDC-RI

References

Boneva and Skumov, 1999
Boneva, S.; Skumov, M., Gas chromatography of tricyclic spiro esters, Chromatographia, 1999, 49, 7/8, 115-118. [all data]