2,4-dichlorobenzyl tridecyl ether

Van Den Dool and Kratz RI, non-polar column, temperature ramp

View large format table.

Column type Active phase I Reference Comment
CapillaryCP Sil 5 CB2483.Wells, Gillespie, et al., 198525. m/0.22 mm/0.12 μm, H2, 3. K/min; Tstart: 100. C
CapillaryCP Sil 5 CB2490.Wells, Gillespie, et al., 198525. m/0.22 mm/0.12 μm, H2, 5. K/min; Tstart: 100. C
CapillaryCP Sil 5 CB2495.Wells, Gillespie, et al., 198525. m/0.22 mm/0.12 μm, H2, 7. K/min; Tstart: 100. C
CapillaryCP Sil 5 CB2495.Wells, Gillespie, et al., 198525. m/0.22 mm/0.12 μm, H2, 9. K/min; Tstart: 100. C
CapillaryCP Sil 5 CB2483.Wells, Gillespie, et al., 198525. m/0.22 mm/0.12 μm, H2, 3. K/min; Tstart: 120. C
CapillaryCP Sil 5 CB2490.Wells, Gillespie, et al., 198525. m/0.22 mm/0.12 μm, H2, 5. K/min; Tstart: 120. C
CapillaryCP Sil 5 CB2495.Wells, Gillespie, et al., 198525. m/0.22 mm/0.12 μm, H2, 7. K/min; Tstart: 120. C
CapillaryCP Sil 5 CB2496.Wells, Gillespie, et al., 198525. m/0.22 mm/0.12 μm, H2, 9. K/min; Tstart: 120. C
CapillaryCP Sil 5 CB2483.Wells, Gillespie, et al., 198525. m/0.22 mm/0.12 μm, H2, 3. K/min; Tstart: 80. C
CapillaryCP Sil 5 CB2491.Wells, Gillespie, et al., 198525. m/0.22 mm/0.12 μm, H2, 5. K/min; Tstart: 80. C
CapillaryCP Sil 5 CB2494.Wells, Gillespie, et al., 198525. m/0.22 mm/0.12 μm, H2, 7. K/min; Tstart: 80. C
CapillaryCP Sil 5 CB2495.Wells, Gillespie, et al., 198525. m/0.22 mm/0.12 μm, H2, 9. K/min; Tstart: 80. C

References

Wells, Gillespie, et al., 1985
Wells, D.E.; Gillespie, M.J.; Porter, A.E.A., Dichlorobenzyl alkyl ether homologs as retention index markers and internal standards for the analysis of environmental samples using capillary gas chromatography, J. Hi. Res. Chromatogr. Chromatogr. Comm., 1985, 8, 8, 443-449, https://doi.org/10.1002/jhrc.1240080818 . [all data]