1,2,6-trimethoxy-4-propylbenzene

Normal alkane RI, non-polar column, temperature ramp

View large format table.

Column type Active phase I Reference Comment
CapillaryDB-11730.Guy and Vernin, 1996He, 70. C @ 5. min, 3. K/min; Column length: 30. m; Column diameter: 0.25 mm; Tend: 300. C

References

Guy and Vernin, 1996
Guy, I.; Vernin, G., Minor compounds from Cistus ladaniferus L. essential oil from esterel. 2. Acids and phenols, J. Essent. Oil Res., 1996, 8, 4, 455-462, https://doi.org/10.1080/10412905.1996.9700666 . [all data]