5α-Estran-3α-ol-17-one, TMS

Normal alkane RI, non-polar column, custom temperature program

Data compiled by: NIST Mass Spectrometry Data Center, William E. Wallace, director

Column type CapillaryCapillary
Active phase DB-1BPX-5
Column length (m) 30.30.
Carrier gas HeHe
Substrate
Column diameter (mm) 0.250.22
Phase thickness (μm) 0.10.25
Program 170C => 20C/min => 260C => 2.7C/min => 305C => 20C/min => 320C170C => 20C/min => 260C => 2.7C/min => 305C => 20C/min => 320C
I 2462.2460.
ReferenceBowers and Borts, 1996Bowers and Borts, 1996
Comment MSDC-RI MSDC-RI

References

Bowers and Borts, 1996
Bowers, L.D.; Borts, D.J., Separation and confirmation of anabolic steroids with quadrupole ion trap tandem mass spectrometry, J. Chromatogr. B, 1996, 687, 1, 69-78, https://doi.org/10.1016/S0378-4347(96)00231-9 . [all data]