2-(2-butoxyethoxy)ethanone

Van Den Dool and Kratz RI, polar column, temperature ramp

Data compiled by: NIST Mass Spectrometry Data Center, William E. Wallace, director

Column type CapillaryCapillary
Active phase DB-WaxDB-Wax
Column length (m) 60.60.
Carrier gas  He
Substrate
Column diameter (mm) 0.250.25
Phase thickness (μm) 0.250.25
Tstart (C) 50.50.
Tend (C) 230.230.
Heat rate (K/min) 2.2.
Initial hold (min)
Final hold (min)
I 1778.1778.
ReferenceShimoda, Shigematsu, et al., 1995Shimoda, Shigematsu, et al., 1995, 2
Comment MSDC-RI MSDC-RI

References

Shimoda, Shigematsu, et al., 1995
Shimoda, M.; Shigematsu, H.; Shiratsuchi, H.; Osajima, Y., Comparison of the odor concentrates by SDE and adsorptive column method from green tea infusion, J. Agric. Food Chem., 1995, 43, 6, 1616-1620, https://doi.org/10.1021/jf00054a037 . [all data]

Shimoda, Shigematsu, et al., 1995, 2
Shimoda, M.; Shigematsu, H.; Shiratsuchi, H.; Osajima, Y., Comparison of volatile compounds among different grades of green tea and their relations to odor attributes, J. Agric. Food Chem., 1995, 43, 6, 1621-1625, https://doi.org/10.1021/jf00054a038 . [all data]