5β-Androstane-3α,17β-diol,bis-TMS

Normal alkane RI, non-polar column, temperature ramp

Data compiled by: NIST Mass Spectrometry Data Center, William E. Wallace, director

Column type CapillaryCapillary
Active phase SE-54SE-54
Column length (m) 20.15.
Carrier gas HeHe
Substrate
Column diameter (mm) 0.250.2
Phase thickness (μm) 0.330.33
Tstart (C) 180.180.
Tend (C) 300.300.
Heat rate (K/min) 5.5.
Initial hold (min)
Final hold (min)
I 2562.2562.
ReferenceSchänzer and Donike, 1992Schänzer and Donike, 1992
Comment MSDC-RI MSDC-RI

References

Schänzer and Donike, 1992
Schänzer, W.; Donike, M., Metabolism of boldenone in man: gas chromatographic/mass spectrometric identification of urinary excreted metabolites and determination of excretion rates, Biol. Mass Spectrom., 1992, 21, 1, 3-16, https://doi.org/10.1002/bms.1200210104 . [all data]