cis-p-Menth-2-en-1,8-diol

Normal alkane RI, non-polar column, temperature ramp

View large format table.

Column type Active phase I Reference Comment
CapillaryDB-11276.Ueno, Masuda, et al., 200460. m/0.25 mm/0.25 μm, N2, 3. K/min, 210. C @ 15. min; Tstart: 80. C
CapillarySE-301285.Peacock and Kuneman, 1985N2, 45. C @ 1. min, 4. K/min; Column length: 100. m; Column diameter: 0.25 mm; Tend: 250. C

Normal alkane RI, polar column, custom temperature program

View large format table.

Column type Active phase I Reference Comment
CapillaryHP-Innowax1797.Baser, Demirci, et al., 200260. m/0.25 mm/0.25 μm, He; Program: 60 0C (10 min) 4 K/min -> 220 0C (10 min) 1 K/min -> 240 0C
CapillaryInnowax1797.Baser, Nuriddinov, et al., 200260. m/0.25 mm/0.25 μm, He; Program: 60C(10min) => 4C/min => 220C(10min) => 1C/min => 240C

References

Ueno, Masuda, et al., 2004
Ueno, T.; Masuda, H.; Ho, C.-T., Formation mechanism of p-methylacetophenone from citral via a tert-alkoxy radical intermediate, J. Agric. Food Chem., 2004, 52, 18, 5677-5684, https://doi.org/10.1021/jf035517j . [all data]

Peacock and Kuneman, 1985
Peacock, V.E.; Kuneman, D.W., Inhibition of the formation of α-p-dimethylstyrene and p-cymen-8-ol in a carbonated citral-containing beverage system, J. Agric. Food Chem., 1985, 33, 3, 330-335, https://doi.org/10.1021/jf00063a003 . [all data]

Baser, Demirci, et al., 2002
Baser, K.H.C.; Demirci, B.; Kirimer, N.; Satil, F.; Tumen, G., The essential oils of Thymus migricus and T. fedtschenkoi var. handelii from Turkey, Flavour Fragr. J., 2002, 17, 1, 41-45, https://doi.org/10.1002/ffj.1036 . [all data]

Baser, Nuriddinov, et al., 2002
Baser, K.H.C.; Nuriddinov, H.R.; Ozek, T.; Demirci, A.B.; Azcan, N.; Nigmatullaev, A.M., Essential oil of Arischrada korolkowii from the Chatkal mountains of Uzbekistan, Chem. Nat. Compd. (Engl. Transl.), 2002, 38, 1, 51-53, https://doi.org/10.1023/A:1015729731464 . [all data]