6,7,8,9,10,11-Hexahydro-5,11a-diaza -cycloocta[b]naphthalen-12-one

Kovats' RI, non-polar column, isothermal

View large format table.

Column type Active phase Temperature (C) I Reference Comment
PackedOV-1240.2181.Papp, Szász, et al., 1991N2, Chromosorb W AW DMCS; Column length: 1.8 m

References

Papp, Szász, et al., 1991
Papp, O.; Szász, Gy.; Kökösi, J.; Hermecz, I., Correlation between structure and gas chromatographic behaviour of nitrogen-containing heterocyclic compounds. III. Variation of ring size, J. Chromatogr., 1991, 537, 377-383, https://doi.org/10.1016/S0021-9673(01)88911-1 . [all data]